{"text_format":"1","workbook":"xlsx","n_sheets":37,"sheets":["STARTUP","ACCT SUM","DATA","1-AST","1-IC","1-WK","1-NMD","1-APP","1-WR","1-TAX","1-BPC","1-UIP","1-SUP","1-UI","1-RATES","1-SUM-$","2","3","4-IC","4-WK","4-NMD","4-APP","4-WR","4-TAX","5-LV","5-MPU","5-BPC","5-UIP","5-SUP","5-AST","5-SUM","6","6-BAL","6-LIST","6-Export","7-Export","CMM Notes"],"not_rendered":{"charts":0,"images":3,"macros":1,"external_links":0,"defined_names":222,"comments":1,"pivot_tables":0},"unopened":[],"bounds":{"document_bytes":16777216,"sheet_cells":100000,"rows_first":2000,"rows_last":500,"rows_between":2000,"halvings":0,"cell_chars":16384,"cell_head_chars":4096},"cells_cut":0,"cells_raw":0,"read":"whole","date_system":"1900"}

{"sheet":"STARTUP","index":0,"n_rows":124,"n_cols":7,"rows_kept":124,"cut":false,"hidden":false,"merged":[[26,1,26,2],[8,1,8,2],[4,4,4,5],[5,4,5,5],[5,1,5,2],[4,0,4,2],[0,4,0,5],[1,4,1,5],[2,4,2,5],[3,4,3,5],[0,0,0,2],[2,0,2,2],[40,0,40,2],[27,1,27,2],[28,1,28,2],[29,1,29,2],[30,1,30,2],[34,1,34,2]]}
["SYSTEM START UP ",null,null,null,"RJM"]
[{"$f":"\"RJM Version: \" & TEXT(E3,\"0.0\")","v":"RJM Version: 2.5"},null,null,null,"Version"]
["RESOURCE JUSTIFICATION MODEL",null,null,null,2.5]
[null,null,null,null,"2015-03-04"]
[]
["STATE NAME","YOUR STATE"]
["  State Abbreviation",{"$f":"VLOOKUP(STATENAME,StateTBL,2)","v":"None"}]
[]
["ACCOUNTING SYSTEM","ACCOUNTING SYSTEM"]
[]
{"$rows_left_out":115}
{"sheet":"ACCT SUM","index":1,"n_rows":52,"n_cols":6,"rows_kept":52,"cut":false,"hidden":false,"merged":[[0,0,0,5],[30,0,30,5],[2,0,2,5],[3,0,3,5],[4,0,4,5]]}
["PREVIOUS YEAR FINANCIAL SUMMARY"]
[{"$f":"\"RJM Version: \" & TEXT(STARTUP!E3,\"0.0\")","v":"RJM Version: 2.5"},null,"ACCT SUM"]
[{"$f":"STATENAME","v":"YOUR STATE"}]
[]
[{"$f":"PREVIOUSFY","v":"FY "}]
["FUND LEDGER",null,"PERSONAL ","PERSONNEL"]
["NAME","#","SERVICES","BENEFITS","NPS","TOTAL"]
["FEDERAL SOURCES"]
["UNEMPLOYMENT INSURANCE",210,null,null,null,{"$f":"SUM(C9:E9)","v":0}]
["UI PERFORMS",213,null,null,null,0]
{"$rows_left_out":43}
{"sheet":"DATA","index":2,"n_rows":69,"n_cols":4,"rows_kept":69,"cut":false,"hidden":false,"merged":[[1,1,1,2],[0,0,0,3],[40,0,40,3],[55,0,55,3],[25,0,25,3],[2,0,2,3],[3,0,3,3],[10,0,10,3],[9,0,9,3],[4,0,4,3],[7,2,7,3],[6,2,6,3]]}
["PREVIOUS YEAR DATA ENTRY SHEET"]
[{"$f":"\"RJM Version: \" & TEXT(STARTUP!E3,\"0.0\")","v":"RJM Version: 2.5"},"DATA"]
[{"$f":"STATENAME","v":"YOUR STATE"}]
[{"$f":"PREVIOUSFY","v":"FY "}]
[{"$f":"IF(C7<>\"\",\" \",\"* * PLEASE IMPORT CROSSWALK * *\")","v":"* * PLEASE IMPORT CROSSWALK * *"}]
[]
[null,"Imported Crosswalk File Name:"]
[null,"Date of Crosswalk File:","2015-10-23T12:52:21"]
[]
[]
{"$rows_left_out":60}
{"sheet":"1-AST","index":3,"n_rows":42,"n_cols":5,"rows_kept":42,"cut":false,"hidden":false,"merged":[[5,0,5,4],[0,0,0,4],[2,0,2,4],[4,0,4,4]]}
["COST PER POSITION  -  AS&T"]
[{"$f":"\"RJM Version: \" & TEXT(STARTUP!E3,\"0.0\")","v":"RJM Version: 2.5"}]
["1-AST"]
[{"$f":"STATENAME","v":"YOUR STATE"}]
["BUDGET YEAR"]
[{"$f":"BUDGETFY","v":"FY "}]
["AS&T"]
[null,{"$f":"PREVIOUSFY","v":"FY "},{"$f":"CURRENTFY","v":"FY "},{"$f":"NEXTFY","v":"FY "},{"$f":"REQUESTFY","v":"FY 1"}]
[null,"PREVIOUS","CURRENT","NEXT","REQUEST"]
[" ","FISCAL YEAR","FISCAL YEAR","FISCAL YEAR","FISCAL YEAR"]
{"$rows_left_out":33}
{"sheet":"1-IC","index":4,"n_rows":42,"n_cols":6,"rows_kept":42,"cut":false,"hidden":false,"merged":[[5,0,5,4],[0,0,0,4],[2,0,2,4],[4,0,4,4]]}
["COST PER POSITION - INITIAL CLAIMS"]
[{"$f":"\"RJM Version: \" & TEXT(STARTUP!E3,\"0.0\")","v":"RJM Version: 2.5"}]
["1-IC"]
[{"$f":"Statename","v":"YOUR STATE"}]
["BUDGET YEAR"]
[{"$f":"BudgetFY","v":"FY "}]
["INITIAL CLAIMS"]
[null,{"$f":"PreviousFY","v":"FY "},{"$f":"CurrentFY","v":"FY "},{"$f":"NextFY","v":"FY "},{"$f":"RequestFY","v":"FY 1"}]
[null,"PREVIOUS","CURRENT","NEXT","REQUEST"]
[" ","FISCAL YEAR","FISCAL YEAR","FISCAL YEAR","FISCAL YEAR"]
{"$rows_left_out":33}
{"sheet":"1-WK","index":5,"n_rows":42,"n_cols":6,"rows_kept":42,"cut":false,"hidden":false,"merged":[[5,0,5,4],[0,0,0,4],[2,0,2,4],[4,0,4,4]]}
["COST PER POSITION - WEEKS CLAIMED"]
[{"$f":"\"RJM Version: \" & TEXT(STARTUP!E3,\"0.0\")","v":"RJM Version: 2.5"}]
["1-WK"]
[{"$f":"Statename","v":"YOUR STATE"}]
["BUDGET YEAR"]
[{"$f":"BudgetFY","v":"FY "}]
["WEEKS CLAIMED"]
[null,{"$f":"PreviousFY","v":"FY "},{"$f":"CurrentFY","v":"FY "},{"$f":"NextFY","v":"FY "},{"$f":"RequestFY","v":"FY 1"}]
[null,"PREVIOUS","CURRENT","NEXT","REQUEST"]
[" ","FISCAL YEAR","FISCAL YEAR","FISCAL YEAR","FISCAL YEAR"]
{"$rows_left_out":33}
{"sheet":"1-NMD","index":6,"n_rows":42,"n_cols":6,"rows_kept":42,"cut":false,"hidden":false,"merged":[[5,0,5,4],[0,0,0,4],[2,0,2,4],[4,0,4,4]]}
["COST PER POSITION - NON-MONETARY DETERMINATIONS"]
[{"$f":"\"RJM Version: \" & TEXT(STARTUP!E3,\"0.0\")","v":"RJM Version: 2.5"}]
["1-NMD"]
[{"$f":"Statename","v":"YOUR STATE"}]
["BUDGET YEAR"]
[{"$f":"BudgetFY","v":"FY "}]
["NON-MONETARY DETERMINATIONS"]
[null,{"$f":"PreviousFY","v":"FY "},{"$f":"CurrentFY","v":"FY "},{"$f":"NextFY","v":"FY "},{"$f":"RequestFY","v":"FY 1"}]
[null,"PREVIOUS","CURRENT","NEXT","REQUEST"]
[" ","FISCAL YEAR","FISCAL YEAR","FISCAL YEAR","FISCAL YEAR"]
{"$rows_left_out":33}
{"sheet":"1-APP","index":7,"n_rows":42,"n_cols":6,"rows_kept":42,"cut":false,"hidden":false,"merged":[[5,0,5,4],[0,0,0,4],[2,0,2,4],[4,0,4,4]]}
["COST PER POSITION - APPEALS"]
[{"$f":"\"RJM Version: \" & TEXT(STARTUP!E3,\"0.0\")","v":"RJM Version: 2.5"}]
["1-APP"]
[{"$f":"Statename","v":"YOUR STATE"}]
["BUDGET YEAR"]
[{"$f":"BUDGETFY","v":"FY "}]
["APPEALS"]
[null,{"$f":"PreviousFY","v":"FY "},{"$f":"CurrentFY","v":"FY "},{"$f":"NextFY","v":"FY "},{"$f":"RequestFY","v":"FY 1"}]
[null,"PREVIOUS","CURRENT","NEXT","REQUEST"]
[" ","FISCAL YEAR","FISCAL YEAR","FISCAL YEAR","FISCAL YEAR"]
{"$rows_left_out":33}
{"sheet":"1-WR","index":8,"n_rows":42,"n_cols":6,"rows_kept":42,"cut":false,"hidden":false,"merged":[[5,0,5,4],[0,0,0,4],[2,0,2,4],[4,0,4,4]]}
["COST PER POSITION - WAGE RECORDS"]
[{"$f":"\"RJM Version: \" & TEXT(STARTUP!E3,\"0.0\")","v":"RJM Version: 2.5"}]
["1-WR"]
[{"$f":"Statename","v":"YOUR STATE"}]
["BUDGET YEAR"]
[{"$f":"'1-WR'!BudgetFY","v":"FY "}]
["WAGE RECORDS"]
[null,{"$f":"'1-WR'!PreviousFY","v":"FY "},{"$f":"'1-WR'!CurrentFY","v":"FY "},{"$f":"'1-WR'!NextFY","v":"FY "},{"$f":"'1-WR'!RequestFY","v":"FY 1"}]
[null,"PREVIOUS","CURRENT","NEXT","REQUEST"]
[" ","FISCAL YEAR","FISCAL YEAR","FISCAL YEAR","FISCAL YEAR"]
{"$rows_left_out":33}
{"sheet":"1-TAX","index":9,"n_rows":42,"n_cols":6,"rows_kept":42,"cut":false,"hidden":false,"merged":[[5,0,5,4],[0,0,0,4],[2,0,2,4],[4,0,4,4]]}
["COST PER POSITION - TAX"]
[{"$f":"\"RJM Version: \" & TEXT(STARTUP!E3,\"0.0\")","v":"RJM Version: 2.5"}]
["1-TAX"]
[{"$f":"Statename","v":"YOUR STATE"}]
["BUDGET YEAR"]
[{"$f":"BudgetFY","v":"FY "}]
["TAX"]
[null,{"$f":"PreviousFY","v":"FY "},{"$f":"CurrentFY","v":"FY "},{"$f":"NextFY","v":"FY "},{"$f":"RequestFY","v":"FY 1"}]
[null,"PREVIOUS","CURRENT","NEXT","REQUEST"]
[" ","FISCAL YEAR","FISCAL YEAR","FISCAL YEAR","FISCAL YEAR"]
{"$rows_left_out":33}
{"sheet":"1-BPC","index":10,"n_rows":42,"n_cols":6,"rows_kept":42,"cut":false,"hidden":false,"merged":[[5,0,5,4],[0,0,0,4],[2,0,2,4],[4,0,4,4]]}
["COST PER POSITION - BENEFIT PAYMENT CONTROL"]
[{"$f":"\"RJM Version: \" & TEXT(STARTUP!E3,\"0.0\")","v":"RJM Version: 2.5"}]
["1-BPC"]
[{"$f":"Statename","v":"YOUR STATE"}]
["BUDGET YEAR"]
[{"$f":"BudgetFY","v":"FY "}]
["BENEFIT PAYMENT CONTROL"]
[null,{"$f":"PreviousFY","v":"FY "},{"$f":"CurrentFY","v":"FY "},{"$f":"NextFY","v":"FY "},{"$f":"RequestFY","v":"FY 1"}]
[null,"PREVIOUS","CURRENT","NEXT","REQUEST"]
[" ","FISCAL YEAR","FISCAL YEAR","FISCAL YEAR","FISCAL YEAR"]
{"$rows_left_out":33}
{"sheet":"1-UIP","index":11,"n_rows":42,"n_cols":6,"rows_kept":42,"cut":false,"hidden":false,"merged":[[5,0,5,4],[0,0,0,4],[2,0,2,4],[4,0,4,4]]}
["COST PER POSITION - UI PERFORMS"]
[{"$f":"\"RJM Version: \" & TEXT(STARTUP!E3,\"0.0\")","v":"RJM Version: 2.5"}]
["1-UIP"]
[{"$f":"Statename","v":"YOUR STATE"}]
["BUDGET YEAR"]
[{"$f":"BudgetFY","v":"FY "}]
["UI PERFORMS"]
[null,{"$f":"PreviousFY","v":"FY "},{"$f":"CurrentFY","v":"FY "},{"$f":"NextFY","v":"FY "},{"$f":"RequestFY","v":"FY 1"}]
[null,"PREVIOUS","CURRENT","NEXT","REQUEST"]
[" ","FISCAL YEAR","FISCAL YEAR","FISCAL YEAR","FISCAL YEAR"]
{"$rows_left_out":33}
{"sheet":"1-SUP","index":12,"n_rows":42,"n_cols":6,"rows_kept":42,"cut":false,"hidden":false,"merged":[[5,0,5,4],[0,0,0,4],[2,0,2,4],[4,0,4,4]]}
["COST PER POSITION - SUPPORT"]
[{"$f":"\"RJM Version: \" & TEXT(STARTUP!E3,\"0.0\")","v":"RJM Version: 2.5"}]
["1-SUP"]
[{"$f":"Statename","v":"YOUR STATE"}]
["BUDGET YEAR"]
[{"$f":"BudgetFY","v":"FY "}]
["SUPPORT"]
[null,{"$f":"PreviousFY","v":"FY "},{"$f":"CurrentFY","v":"FY "},{"$f":"NextFY","v":"FY "},{"$f":"RequestFY","v":"FY 1"}]
[null,"PREVIOUS","CURRENT","NEXT","REQUEST"]
[" ","FISCAL YEAR","FISCAL YEAR","FISCAL YEAR","FISCAL YEAR"]
{"$rows_left_out":33}
{"sheet":"1-UI","index":13,"n_rows":42,"n_cols":6,"rows_kept":42,"cut":false,"hidden":false,"merged":[[5,0,5,4],[0,0,0,4],[2,0,2,4],[4,0,4,4]]}
["COST PER POSITION - TOTAL UI"]
[{"$f":"\"RJM Version: \" & TEXT(STARTUP!E3,\"0.0\")","v":"RJM Version: 2.5"}]
["1-UI"]
[{"$f":"STATENAME","v":"YOUR STATE"}]
["BUDGET YEAR"]
[{"$f":"BUDGETFY","v":"FY "}]
["U.I. PROGRAM"]
["  (EXCLUDE AS&T)",{"$f":"PREVIOUSFY","v":"FY "},{"$f":"CURRENTFY","v":"FY "},{"$f":"NEXTFY","v":"FY "},{"$f":"REQUESTFY","v":"FY 1"}]
[null,"PREVIOUS","CURRENT","NEXT","REQUEST"]
[" ","FISCAL YEAR","FISCAL YEAR","FISCAL YEAR","FISCAL YEAR"]
{"$rows_left_out":33}
{"sheet":"1-RATES","index":14,"n_rows":56,"n_cols":5,"rows_kept":56,"cut":false,"hidden":false,"merged":[[46,0,46,4],[44,0,44,4],[45,0,45,4],[31,0,31,4],[0,0,0,4],[2,0,2,4],[29,0,29,4],[30,0,30,4],[4,0,4,4],[5,0,5,4]]}
["PS/PB COST PER POSITION - SUMMARY"]
[{"$f":"\"RJM Version: \" & TEXT(STARTUP!E3,\"0.0\")","v":"RJM Version: 2.5"}]
["1-RATES"]
[{"$f":"Statename","v":"YOUR STATE"}]
["BUDGET YEAR"]
[{"$f":"BudgetFY","v":"FY "}]
[]
[null,{"$f":"PreviousFY","v":"FY "},{"$f":"CurrentFY","v":"FY "},{"$f":"NextFY","v":"FY "},{"$f":"RequestFY","v":"FY 1"}]
[null,"PREVIOUS","CURRENT","NEXT","REQUEST"]
[null,"FISCAL YEAR","FISCAL YEAR","FISCAL YEAR","FISCAL YEAR"]
{"$rows_left_out":47}
{"sheet":"1-SUM-$","index":15,"n_rows":41,"n_cols":5,"rows_kept":41,"cut":false,"hidden":false,"merged":[[5,0,5,4],[0,0,0,4],[2,0,2,4],[4,0,4,4]]}
["PS/PB COST - SUMMARY"]
[{"$f":"\"RJM Version: \" & TEXT(STARTUP!E3,\"0.0\")","v":"RJM Version: 2.5"}]
["1-SUM-$"]
[{"$f":"'1-SUM-$'!Statename","v":"YOUR STATE"}]
["BUDGET YEAR"]
[{"$f":"BudgetFY","v":"FY "}]
[]
[null,{"$f":"PreviousFY","v":"FY "},{"$f":"CurrentFY","v":"FY "},{"$f":"NextFY","v":"FY "},{"$f":"RequestFY","v":"FY 1"}]
[null,"PREVIOUS","CURRENT","NEXT","REQUEST"]
[null,"FISCAL YEAR","FISCAL YEAR","FISCAL YEAR","FISCAL YEAR"]
{"$rows_left_out":32}
{"sheet":"2","index":16,"n_rows":29,"n_cols":5,"rows_kept":29,"cut":false,"hidden":false,"merged":[[6,2,6,4],[5,2,5,4],[2,22,2,26],[0,22,0,26],[0,0,0,4],[2,0,2,4],[3,0,3,4]]}
["BASE NPS  (by CATEGORY) - NON-PERSONAL SERVICES (NPS)"]
[{"$f":"\"RJM Version: \" & TEXT(STARTUP!E3,\"0.0\")","v":"RJM Version: 2.5"}]
[2]
[]
[]
[]
[]
[]
[{"$f":"STATENAME","v":"YOUR STATE"},"BUDGET YEAR"]
[null,{"$f":"BUDGETFY","v":"FY "}]
{"$rows_left_out":20}
{"sheet":"3","index":17,"n_rows":27,"n_cols":6,"rows_kept":27,"cut":false,"hidden":false,"merged":[[3,0,3,4],[0,0,0,4],[2,0,2,4],[7,1,7,4],[6,1,6,4]]}
["ANNUALIZED WORKLOADS"]
[{"$f":"\"RJM Version: \" & TEXT(STARTUP!E3,\"0.0\")","v":"RJM Version: 2.5"}]
[3]
[{"$f":"IF(A10=F5,\" \",\"* * PLEASE IMPORT WORKLOADS * *\")","v":"* * PLEASE IMPORT WORKLOADS * *"},null,null,null,null,{"$f":"MATCH(STARTUP!B6,StateNameLIST,0) + 5","v":59}]
[null,null,null,null,null,"VIRGINIA"]
[]
["Imported Workload File Name:"]
["Date of File:","2015-01-13T13:12:39"]
[]
[{"$f":"'3'!Statename","v":"YOUR STATE"},"BUDGET YEAR"]
{"$rows_left_out":18}
{"sheet":"4-IC","index":18,"n_rows":32,"n_cols":5,"rows_kept":32,"cut":false,"hidden":false,"merged":[[5,0,5,4],[0,0,0,4],[2,0,2,4],[4,0,4,4]]}
["INITIAL CLAIMS  -  MINUTES PER UNIT (MPU)"]
[{"$f":"\"RJM Version: \" & TEXT(STARTUP!E3,\"0.0\")","v":"RJM Version: 2.5"}]
["4-IC"]
[{"$f":"Statename","v":"YOUR STATE"}]
["BUDGET YEAR"]
[{"$f":"BudgetFY","v":"FY "}]
[]
[null,{"$f":"PreviousFY","v":"FY "},{"$f":"CurrentFY","v":"FY "},{"$f":"NextFY","v":"FY "},{"$f":"RequestFY","v":"FY 1"}]
[null,"PREVIOUS","CURRENT","NEXT","REQUEST"]
[null,"FISCAL YEAR","FISCAL YEAR","FISCAL YEAR","FISCAL YEAR"]
{"$rows_left_out":23}
{"sheet":"4-WK","index":19,"n_rows":32,"n_cols":5,"rows_kept":32,"cut":false,"hidden":false,"merged":[[5,0,5,4],[0,0,0,4],[2,0,2,4],[4,0,4,4]]}
["WEEKS CLAIMED  -  MINUTES PER UNIT (MPU)"]
[{"$f":"\"RJM Version: \" & TEXT(STARTUP!E3,\"0.0\")","v":"RJM Version: 2.5"}]
["4-WK"]
[{"$f":"Statename","v":"YOUR STATE"}]
["BUDGET YEAR"]
[{"$f":"BudgetFY","v":"FY "}]
[]
[null,{"$f":"PreviousFY","v":"FY "},{"$f":"CurrentFY","v":"FY "},{"$f":"NextFY","v":"FY "},{"$f":"RequestFY","v":"FY 1"}]
[null,"PREVIOUS","CURRENT","NEXT","REQUEST"]
[null,"FISCAL YEAR","FISCAL YEAR","FISCAL YEAR","FISCAL YEAR"]
{"$rows_left_out":23}
{"sheet":"4-NMD","index":20,"n_rows":32,"n_cols":5,"rows_kept":32,"cut":false,"hidden":false,"merged":[[5,0,5,4],[0,0,0,4],[2,0,2,4],[4,0,4,4]]}
["NON-MONETARY DETERMINATIONS  -  MINUTES PER UNIT (MPU)"]
[{"$f":"\"RJM Version: \" & TEXT(STARTUP!E3,\"0.0\")","v":"RJM Version: 2.5"}]
["4-NMD"]
[{"$f":"Statename","v":"YOUR STATE"}]
["BUDGET YEAR"]
[{"$f":"BudgetFY","v":"FY "}]
[]
[null,{"$f":"PreviousFY","v":"FY "},{"$f":"CurrentFY","v":"FY "},{"$f":"NextFY","v":"FY "},{"$f":"RequestFY","v":"FY 1"}]
[null,"PREVIOUS","CURRENT","NEXT","REQUEST"]
[null,"FISCAL YEAR","FISCAL YEAR","FISCAL YEAR","FISCAL YEAR"]
{"$rows_left_out":23}
{"sheet":"4-APP","index":21,"n_rows":32,"n_cols":5,"rows_kept":32,"cut":false,"hidden":false,"merged":[[5,0,5,4],[0,0,0,4],[2,0,2,4],[4,0,4,4]]}
["APPEALS  -  MINUTES PER UNIT (MPU)"]
[{"$f":"\"RJM Version: \" & TEXT(STARTUP!E3,\"0.0\")","v":"RJM Version: 2.5"}]
["4-APP"]
[{"$f":"Statename","v":"YOUR STATE"}]
["BUDGET YEAR"]
[{"$f":"BudgetFY","v":"FY "}]
[]
[null,{"$f":"PreviousFY","v":"FY "},{"$f":"CurrentFY","v":"FY "},{"$f":"NextFY","v":"FY "},{"$f":"RequestFY","v":"FY 1"}]
[null,"PREVIOUS","CURRENT","NEXT","REQUEST"]
[null,"FISCAL YEAR","FISCAL YEAR","FISCAL YEAR","FISCAL YEAR"]
{"$rows_left_out":23}
{"sheet":"4-WR","index":22,"n_rows":32,"n_cols":5,"rows_kept":32,"cut":false,"hidden":false,"merged":[[5,0,5,4],[0,0,0,4],[2,0,2,4],[4,0,4,4]]}
["WAGE RECORDS  -  MINUTES PER UNIT (MPU)"]
[{"$f":"\"RJM Version: \" & TEXT(STARTUP!E3,\"0.0\")","v":"RJM Version: 2.5"}]
["4-WR"]
[{"$f":"Statename","v":"YOUR STATE"}]
["BUDGET YEAR"]
[{"$f":"BudgetFY","v":"FY "}]
[]
[null,{"$f":"PreviousFY","v":"FY "},{"$f":"CurrentFY","v":"FY "},{"$f":"NextFY","v":"FY "},{"$f":"RequestFY","v":"FY 1"}]
[null,"PREVIOUS","CURRENT","NEXT","REQUEST"]
[null,"FISCAL YEAR","FISCAL YEAR","FISCAL YEAR","FISCAL YEAR"]
{"$rows_left_out":23}
{"sheet":"4-TAX","index":23,"n_rows":32,"n_cols":5,"rows_kept":32,"cut":false,"hidden":false,"merged":[[5,0,5,4],[0,0,0,4],[2,0,2,4],[4,0,4,4]]}
["TAX  -  MINUTES PER UNIT (MPU)"]
[{"$f":"\"RJM Version: \" & TEXT(STARTUP!E3,\"0.0\")","v":"RJM Version: 2.5"}]
["4-TAX"]
[{"$f":"Statename","v":"YOUR STATE"}]
["BUDGET YEAR"]
[{"$f":"BudgetFY","v":"FY "}]
[]
[null,{"$f":"PreviousFY","v":"FY "},{"$f":"CurrentFY","v":"FY "},{"$f":"NextFY","v":"FY "},{"$f":"RequestFY","v":"FY 1"}]
[null,"PREVIOUS","CURRENT","NEXT","REQUEST"]
[null,"FISCAL YEAR","FISCAL YEAR","FISCAL YEAR","FISCAL YEAR"]
{"$rows_left_out":23}
{"sheet":"5-LV","index":24,"n_rows":53,"n_cols":5,"rows_kept":53,"cut":false,"hidden":false,"merged":[[2,0,2,4],[0,0,0,4],[4,0,4,4],[5,0,5,4]]}
["LEAVE SUMMARY - POSITION  REQUIREMENTS"]
[{"$f":"\"RJM Version: \" & TEXT(STARTUP!E3,\"0.0\")","v":"RJM Version: 2.5"}]
["5-LV"]
[{"$f":"STATENAME","v":"YOUR STATE"}]
["BUDGET YEAR"]
[{"$f":"BUDGETFY","v":"FY "}]
[]
[]
[null,{"$f":"PREVIOUSFY","v":"FY "},{"$f":"CURRENTFY","v":"FY "},{"$f":"NEXTFY","v":"FY "},{"$f":"REQUESTFY","v":"FY 1"}]
[null,"PREVIOUS","CURRENT","NEXT","REQUEST"]
{"$rows_left_out":44}
{"sheet":"5-MPU","index":25,"n_rows":46,"n_cols":5,"rows_kept":46,"cut":false,"hidden":false,"merged":[[5,0,5,4],[0,0,0,4],[2,0,2,4],[4,0,4,4]]}
["WORKLOAD ITEMS - POSITION  REQUIREMENTS"]
[{"$f":"\"RJM Version: \" & TEXT(STARTUP!E3,\"0.0\")","v":"RJM Version: 2.5"}]
["5-MPU"]
[{"$f":"'5-MPU'!Statename","v":"YOUR STATE"}]
["BUDGET YEAR"]
[{"$f":"'5-MPU'!BudgetFY","v":"FY "}]
[]
[null,{"$f":"'5-MPU'!PreviousFY","v":"FY "},{"$f":"'5-MPU'!CurrentFY","v":"FY "},{"$f":"'5-MPU'!NextFY","v":"FY "},{"$f":"'5-MPU'!RequestFY","v":"FY 1"}]
[null,"PREVIOUS","CURRENT","NEXT","REQUEST"]
[null,"FISCAL YEAR","FISCAL YEAR","FISCAL YEAR","FISCAL YEAR"]
{"$rows_left_out":37}
{"sheet":"5-BPC","index":26,"n_rows":26,"n_cols":5,"rows_kept":26,"cut":false,"hidden":false,"merged":[[5,0,5,4],[0,0,0,4],[2,0,2,4],[4,0,4,4]]}
["BENEFIT PAYMENT CONTROL - POSITION  REQUIREMENTS"]
[{"$f":"\"RJM Version: \" & TEXT(STARTUP!E3,\"0.0\")","v":"RJM Version: 2.5"}]
["5-BPC"]
[{"$f":"'5-BPC'!Statename","v":"YOUR STATE"}]
["BUDGET YEAR"]
[{"$f":"'5-BPC'!BudgetFY","v":"FY "}]
[]
[null,{"$f":"'5-BPC'!PreviousFY","v":"FY "},{"$f":"'5-BPC'!CurrentFY","v":"FY "},{"$f":"'5-BPC'!NextFY","v":"FY "},{"$f":"'5-BPC'!RequestFY","v":"FY 1"}]
[null,"PREVIOUS","CURRENT","NEXT","REQUEST"]
[null,"FISCAL YEAR","FISCAL YEAR","FISCAL YEAR","FISCAL YEAR"]
{"$rows_left_out":17}
{"sheet":"5-UIP","index":27,"n_rows":26,"n_cols":5,"rows_kept":26,"cut":false,"hidden":false,"merged":[[5,0,5,4],[0,0,0,4],[2,0,2,4],[4,0,4,4]]}
["U.I. PERFORMS - POSITION  REQUIREMENTS"]
[{"$f":"\"RJM Version: \" & TEXT(STARTUP!E3,\"0.0\")","v":"RJM Version: 2.5"}]
["5-UIP"]
[{"$f":"Statename","v":"YOUR STATE"}]
["BUDGET YEAR"]
[{"$f":"BudgetFY","v":"FY "}]
[]
[null,{"$f":"PreviousFY","v":"FY "},{"$f":"CurrentFY","v":"FY "},{"$f":"NextFY","v":"FY "},{"$f":"RequestFY","v":"FY 1"}]
[null,"PREVIOUS","CURRENT","NEXT","REQUEST"]
[null,"FISCAL YEAR","FISCAL YEAR","FISCAL YEAR","FISCAL YEAR"]
{"$rows_left_out":17}
{"sheet":"5-SUP","index":28,"n_rows":26,"n_cols":5,"rows_kept":26,"cut":false,"hidden":false,"merged":[[5,0,5,4],[0,0,0,4],[2,0,2,4],[4,0,4,4]]}
["SUPPORT - POSITION  REQUIREMENTS"]
[{"$f":"\"RJM Version: \" & TEXT(STARTUP!E3,\"0.0\")","v":"RJM Version: 2.5"}]
["5-SUP"]
[{"$f":"Statename","v":"YOUR STATE"}]
["BUDGET YEAR"]
[{"$f":"BudgetFY","v":"FY "}]
[]
[null,{"$f":"PreviousFY","v":"FY "},{"$f":"CurrentFY","v":"FY "},{"$f":"NextFY","v":"FY "},{"$f":"RequestFY","v":"FY 1"}]
[null,"PREVIOUS","CURRENT","NEXT","REQUEST"]
[null,"FISCAL YEAR","FISCAL YEAR","FISCAL YEAR","FISCAL YEAR"]
{"$rows_left_out":17}
{"sheet":"5-AST","index":29,"n_rows":26,"n_cols":5,"rows_kept":26,"cut":false,"hidden":false,"merged":[[5,0,5,4],[0,0,0,4],[2,0,2,4],[4,0,4,4]]}
["AS&T - POSITION  REQUIREMENTS"]
[{"$f":"\"RJM Version: \" & TEXT(STARTUP!E3,\"0.0\")","v":"RJM Version: 2.5"}]
["5-AST"]
[{"$f":"Statename","v":"YOUR STATE"}]
["BUDGET YEAR"]
[{"$f":"BudgetFY","v":"FY "}]
[]
[null,{"$f":"PreviousFY","v":"FY "},{"$f":"CurrentFY","v":"FY "},{"$f":"NextFY","v":"FY "},{"$f":"RequestFY","v":"FY 1"}]
[null,"PREVIOUS","CURRENT","NEXT","REQUEST"]
[null,"FISCAL YEAR","FISCAL YEAR","FISCAL YEAR","FISCAL YEAR"]
{"$rows_left_out":17}
{"sheet":"5-SUM","index":30,"n_rows":31,"n_cols":5,"rows_kept":31,"cut":false,"hidden":false,"merged":[[5,0,5,4],[0,0,0,4],[2,0,2,4],[4,0,4,4]]}
["POSITION SUMMARY - POSITION  REQUIREMENTS"]
[{"$f":"\"RJM Version: \" & TEXT(STARTUP!E3,\"0.0\")","v":"RJM Version: 2.5"}]
["5-SUM"]
[{"$f":"Statename","v":"YOUR STATE"}]
["BUDGET YEAR"]
[{"$f":"BudgetFY","v":"FY "}]
[]
[null,{"$f":"PreviousFY","v":"FY "},{"$f":"CurrentFY","v":"FY "},{"$f":"NextFY","v":"FY "},{"$f":"RequestFY","v":"FY 1"}]
[null,"PREVIOUS","CURRENT","NEXT","REQUEST"]
[null,"FISCAL YEAR","FISCAL YEAR","FISCAL YEAR","FISCAL YEAR"]
{"$rows_left_out":22}
{"sheet":"6","index":31,"n_rows":50,"n_cols":6,"rows_kept":50,"cut":false,"hidden":false,"merged":[[5,0,5,5],[28,0,28,5],[29,0,29,5],[0,0,0,5],[2,0,2,5],[4,0,4,5]]}
["BASE DOLLARS REQUESTED BY COST CODE - GENERAL"]
[{"$f":"\"RJM Version: \" & TEXT(STARTUP!E3,\"0.0\")","v":"RJM Version: 2.5"}]
[6]
[{"$f":"STATENAME","v":"YOUR STATE"}]
["BUDGET YEAR"]
[{"$f":"NEXTFY","v":"FY "}]
[]
["ACTIVITY","WORKLOAD","MPU","STAFF YEARS","PS/PB COST PER SY","TOTAL COST"]
["  INITIAL CLAIMS",{"$f":"'3'!$D$17","v":0},{"$f":"'5-MPU'!D15","v":0},{"$f":"'5-SUM'!D14","v":0},{"$f":"'1-RATES'!$D$14","v":0},{"$f":"D9*E9","v":0}]
["  WEEKS CLAIMED",{"$f":"'3'!$D$19","v":0},{"$f":"'5-MPU'!D20","v":0},{"$f":"'5-SUM'!D15","v":0},{"$f":"'1-RATES'!$D$15","v":0},0]
{"$rows_left_out":41}
{"sheet":"6-BAL","index":32,"n_rows":48,"n_cols":5,"rows_kept":48,"cut":false,"hidden":false,"merged":[[0,0,0,4],[2,0,2,4]]}
[]
[{"$f":"\"RJM Version: \" & TEXT(STARTUP!E3,\"0.0\")","v":"RJM Version: 2.5"}]
["6-BAL"]
[{"$f":"STATENAME","v":"YOUR STATE"}]
[]
[null,{"$f":"PREVIOUSFY","v":"FY "}]
[null,"PREVIOUS"]
[null,"FISCAL YEAR"]
["PERSONAL SERVICES "]
["PERSONAL SERVICES DOLLARS - ACCT SUM",{"$f":"'ACCT SUM'!C50","v":0}]
{"$rows_left_out":39}
{"sheet":"6-LIST","index":33,"n_rows":78,"n_cols":5,"rows_kept":78,"cut":false,"hidden":true,"merged":[[78,0,78,1],[50,0,50,1],[0,0,0,3],[2,0,2,3],[3,0,3,1]]}
["FORM CHECK LIST - GENERAL"]
[{"$f":"\"RJM Version: \" & TEXT(STARTUP!E3,\"0.0\")","v":"RJM Version: 2.5"},null,null,"Rev. 10/14/2002"]
["6-LIST",null,null,null," "]
[{"$f":"STATENAME","v":"YOUR STATE"}]
[]
[null,"Legend for 1st digit of Form Number:","RJM"]
[null,"  1 = Personal Service/Personnel Benefits Cost (PS/PB)","Version"]
[null,"  2 = Non-Personal Services Cost (NPS)",{"$f":"STARTUP!E3","v":"1900-01-02T12:00:00"}]
[null,"  3 = Workload",{"$f":"MAX(D15:D48)","v":{"$error":"#VALUE!"}}]
[null,"  4 = Minutes Per Unit (MPU)"]
{"$rows_left_out":69}
{"sheet":"6-Export","index":34,"n_rows":246,"n_cols":9,"rows_kept":246,"cut":false,"hidden":true,"merged":[]}
["Startup","StateName",null,{"$f":"STARTUP!$B$6","v":"YOUR STATE"},null,"Version",{"$f":"STARTUP!E3","v":2.5},null,"State Name/Version"]
[{"$f":"+A1","v":"Startup"},"StateID",null,{"$f":"STARTUP!$B$7","v":"None"},null,null,null,null,"State Abbreviation"]
[{"$f":"+A2","v":"Startup"},"Budget Year",null,{"$f":"STARTUP!$B$11","v":0},null,null,null,null,"Budget Year, for example PY=2006, Budget Year=2008"]
["Startup","PY-Hours",null,{"$f":"STARTUP!$B$16","v":0},null,null,null,null,"Standard Hours in Prior Year"]
["Startup","CY-Hours",null,{"$f":"STARTUP!$B$19","v":0},null,null,null,null,"Standard Hours in Current Year"]
["Startup","NY-Hours",null,{"$f":"STARTUP!$B$22","v":0},null,null,null,null,"Standard Hours in Next Year"]
["Startup","RY-Hours",null,{"$f":"STARTUP!$B$25","v":{"$error":"#N/A"}},null,null,null,null,"Standard Hours in Request Year"]
["Startup","HrsPerDay",null,{"$f":"STARTUP!B13","v":0},null,null,null,null,"Number of Months Completed in Current Year"]
["Startup","ExpDate",null,{"$f":"STARTUP!$B$35","v":"00:00:00"},null,null,null,null,"Date of Last Data Export"]
["Startup","SubDate",null,{"$f":"STARTUP!$B$27","v":"00:00:00"},null,null,null,null,"Date of Submission"]
{"$rows_left_out":237}
{"sheet":"7-Export","index":35,"n_rows":1164,"n_cols":5,"rows_kept":1164,"cut":false,"hidden":true,"merged":[]}
[null,"{STARTUP}"]
["INSERT INTO STARTUP"]
["VALUES ("]
[{"$f":"\"'\"&'6-Export'!$D$1&\"',\"","v":"'YOUR STATE',"},"{State Name}","STRT_ST_NAME CHAR (20) NOT NULL,"]
[{"$f":"\"'\"&'6-Export'!$D$2&\"',\"","v":"'None',"},"{State Abbreviation}","STRT_STATE_ID CHAR (2) NOT NULL,"]
[{"$f":"'6-Export'!$D$3&\",\"","v":"0,"},"{REQUEST YEAR}","STRT_RY INT NOT NULL,"]
[{"$f":"IF('6-Export'!$D$4=0,\"0.00,\",ROUND('6-Export'!$D$4,2)&\",\")","v":"0.00,"},"{PREVIOUS YEAR STANDARD HOURS}","STRT_PY_HOURS DECIMAL (7,2) NOT NULL,"]
[{"$f":"IF('6-Export'!$D$5=0,\"0.00,\",ROUND('6-Export'!$D$5,2)&\",\")","v":"0.00,"},"{CURRENT YEAR STANDARD HOURS}","STRT_CY_HOURS  DECIMAL (7,2) NOT NULL,"]
[{"$f":"IF('6-Export'!$D$6=0,\"0.00,\",ROUND('6-Export'!$D$6,2)&\",\")","v":"0.00,"},"{NEXT YEAR STANDARD HOURS}","STRT_NY_HOURS DECIMAL (7,2) NOT NULL,"]
[{"$f":"IF('6-Export'!$D$7=0,\"0.00,\",ROUND('6-Export'!$D$7,2)&\",\")","v":{"$error":"#N/A"}},"{REQUEST YEAR STANDARD HOURS}","STRT_RY_HOURS DECIMAL (7,2) NOT NULL,"]
{"$rows_left_out":1155}
{"sheet":"CMM Notes","index":36,"n_rows":7,"n_cols":4,"rows_kept":7,"cut":false,"hidden":true,"merged":[[0,0,0,3],[2,0,2,3]]}
["CMM Notes"]
[{"$f":"\"RJM Version: \" & STARTUP!E3","v":"RJM Version: 2.5"},null,null,"Rev. 10/14/2002"]
[]
[]
["Date","Change by","Version name","Notes"]
[]
["2002-10-14","PWN","2-TNG","NEW VERSION"]